Reaction Details
TargetBeta-lactamase
LigandBDBM98798
Substrate/CompetitorBDBM98856
Meas. Tech.Spectrophotometric Assay
IC50 3±0.0 nM
Citation Blizzard, TAChen, HGude, CHermes, JDImbriglio, JKim, SWu, JYMortko, CJMangion, IRivera, NRuck, RTShevlin, M Beta-lactamase inhibitors US Patent US8487093 Publication Date 7/16/2013
 
Beta-lactamase
Name:Beta-lactamase
Synonyms:Beta-lactamase (AmpC)
Type:Enzyme
Mol. Mass.:43489.98
Organism:Pseudomonas aeruginosa
Description:Q3LG62
Residue:397
BDBM98798
BDBM98856
NameBDBM98798
Synonyms:US8487093, 186
TypeSmall organic molecule
Emp. Form.C14H19N5O6S
Mol. Mass.385.396
SMILESCN(C)c1ccnc(NC(=O)[C@@H]2CC[C@@H]3CN2C(=O)N3OS(O)(=O)=O)c1