Reaction Details
TargetBeta-lactamase
LigandBDBM98811
Substrate/CompetitorBDBM98856
Meas. Tech.Spectrophotometric Assay
IC50 6±0.0 nM
Citation Blizzard, TAChen, HGude, CHermes, JDImbriglio, JKim, SWu, JYMortko, CJMangion, IRivera, NRuck, RTShevlin, M Beta-lactamase inhibitors US Patent US8487093 Publication Date 7/16/2013
 
Beta-lactamase
Name:Beta-lactamase
Synonyms:Beta-lactamase (AmpC)
Type:Enzyme
Mol. Mass.:43489.98
Organism:Pseudomonas aeruginosa
Description:Q3LG62
Residue:397
BDBM98811
BDBM98856
NameBDBM98811
Synonyms:US8487093, 202
TypeSmall organic molecule
Emp. Form.C11H13N5O6S
Mol. Mass.343.316
SMILESOS(=O)(=O)ON1[C@H]2CN([C@@H](CC2)C(=O)Nc2cnccn2)C1=O