Reaction Details
TargetMuscarinic acetylcholine receptor M4
LigandBDBM280424
Substrate/Competitorn/a
Meas. Tech.In Vitro M4 &M2 Functional Assay
EC50 20.0±n/a nM
Citation Livermore, DWhite, KCongreve, MBrown, GO Brien, M Piperidin-1-yl and azepin-1-yl carboxylates as muscarinic M4 receptor agonists US Patent US10030012 Publication Date 7/24/2018
 
Muscarinic acetylcholine receptor M4
Name:Muscarinic acetylcholine receptor M4
Type:Enzyme Catalytic Domain
Mol. Mass.:53079.31
Organism:Homo sapiens (Human)
Description:Cholinergic, muscarinic M4 CHRM4 HUMAN M3::P08173
Residue:479
BDBM280424
NameBDBM280424
Synonyms:US10030012, Example 54 | ethyl 4-(4-{2-[(3- methyl-1,2- oxazol-5- yl)methoxy] pyridin-3- yl}piperidin-1- yl)azepane-1- carboxylate
TypeSmall organic molecule
Emp. Form.C24H34N4O4
Mol. Mass.442.5512
SMILESCCOC(=O)N1CCCC(CC1)N1CCC(CC1)c1cccnc1OCc1cc(C)no1