Reaction Details
TargetTyrosine-protein kinase JAK2
LigandBDBM99520
Substrate/Competitorn/a
Meas. Tech.In Vitro Enzyme Assay
IC50 0.6±0.0 nM
Citation Curry, MADorsey, BDDugan, BJGingrich, DEMesaros, EFMilkiewicz, KL Preparation and uses of 1,2,4-triazolo [1,5a] pyridine derivatives US Patent US8501936 Publication Date 8/6/2013
 
Tyrosine-protein kinase JAK2
Name:Tyrosine-protein kinase JAK2
Type:Protein
Mol. Mass.:130684.68
Organism:Homo sapiens (Human)
Description:O60674
Residue:1132
BDBM99520
NameBDBM99520
Synonyms:US8501936, 18
TypeSmall organic molecule
Emp. Form.C24H25N5O2S
Mol. Mass.447.553
SMILESCS(=O)(=O)c1ccc(cc1)-c1cccn2nc(Nc3ccc(cc3)N3CCCCC3)nc12