Reaction Details
TargetTyrosine-protein kinase JAK2
LigandBDBM99565
Substrate/Competitorn/a
Meas. Tech.In Vitro Enzyme Assay
IC50 0.6±0.0 nM
Citation Curry, MADorsey, BDDugan, BJGingrich, DEMesaros, EFMilkiewicz, KL Preparation and uses of 1,2,4-triazolo [1,5a] pyridine derivatives US Patent US8501936 Publication Date 8/6/2013
 
Tyrosine-protein kinase JAK2
Name:Tyrosine-protein kinase JAK2
Type:Protein
Mol. Mass.:130684.68
Organism:Homo sapiens (Human)
Description:O60674
Residue:1132
BDBM99565
NameBDBM99565
Synonyms:US8501936, 63
TypeSmall organic molecule
Emp. Form.C25H29N7O2S
Mol. Mass.491.608
SMILESCN(c1ccc(cc1)-c1cccn2nc(Nc3cccc(c3)N3CCN(C)CC3)nc12)S(C)(=O)=O