Reaction Details
TargetReverse transcriptase protein
LigandBDBM99896
Substrate/Competitorn/a
Meas. Tech.Enzyme Inhibition Assay
IC50 1.220e+4±n/a nM
Citation Bode, MLRousseau, ALGravestock, DMoleele, SSVan Der Westhuyzen, CW Imidazopyridines and imidazopyrimidines as HIV-1 reverse transcriptase inhibitors US Patent US8501767 Publication Date 8/6/2013
 
Reverse transcriptase protein
Name:Reverse transcriptase protein
Synonyms:n/a
Type:Protein
Mol. Mass.:30157.99
Organism:Human immunodeficiency virus 1
Description:Q9WJP9
Residue:259
BDBM99896
NameBDBM99896
Synonyms:US8501767, 99
TypeSmall organic molecule
Emp. Form.C19H19BrClN3
Mol. Mass.404.731
SMILESClc1ccccc1-c1nc2ccc(Br)cn2c1NC1CCCCC1