Reaction Details
TargetReverse transcriptase protein
LigandBDBM2158
Substrate/Competitorn/a
Meas. Tech.Enzyme Inhibition Assay
IC50 90000±n/a nM
Citation Bode, MLRousseau, ALGravestock, DMoleele, SSVan Der Westhuyzen, CW Imidazopyridines and imidazopyrimidines as HIV-1 reverse transcriptase inhibitors US Patent US8501767 Publication Date 8/6/2013
 
Reverse transcriptase protein
Name:Reverse transcriptase protein
Synonyms:n/a
Type:Protein
Mol. Mass.:30157.99
Organism:Human immunodeficiency virus 1
Description:Q9WJP9
Residue:259
BDBM2158
NameBDBM2158
Typen/a
Emp. Form.C20H21ClFN3
Mol. Mass.357.852
SMILESCc1ccc(Cl)c(-c2nc3ccccn3c2NC2CCCCC2)c1F