Reaction Details
TargetReverse transcriptase protein
LigandBDBM2161
Substrate/Competitorn/a
Meas. Tech.Enzyme Inhibition Assay
IC50 21760±n/a nM
Citation Bode, MLRousseau, ALGravestock, DMoleele, SSVan Der Westhuyzen, CW Imidazopyridines and imidazopyrimidines as HIV-1 reverse transcriptase inhibitors US Patent US8501767 Publication Date 8/6/2013
 
Reverse transcriptase protein
Name:Reverse transcriptase protein
Synonyms:n/a
Type:Protein
Mol. Mass.:30157.99
Organism:Human immunodeficiency virus 1
Description:Q9WJP9
Residue:259
BDBM2161
NameBDBM2161
Typen/a
Emp. Form.C19H19Cl2N3
Mol. Mass.360.28
SMILESClc1ccc(-c2nc3ccccn3c2NC2CCCCC2)c(Cl)c1