Reaction Details
TargetReverse transcriptase protein
LigandBDBM2173
Substrate/Competitorn/a
Meas. Tech.Enzyme Inhibition Assay
IC50 3470±n/a nM
Citation Bode, MLRousseau, ALGravestock, DMoleele, SSVan Der Westhuyzen, CW Imidazopyridines and imidazopyrimidines as HIV-1 reverse transcriptase inhibitors US Patent US8501767 Publication Date 8/6/2013
 
Reverse transcriptase protein
Name:Reverse transcriptase protein
Synonyms:n/a
Type:Protein
Mol. Mass.:30157.99
Organism:Human immunodeficiency virus 1
Description:Q9WJP9
Residue:259
BDBM2173
NameBDBM2173
Typen/a
Emp. Form.C20H19ClN4
Mol. Mass.350.845
SMILESClc1ccccc1-c1nc2cccc(C#N)n2c1NC1CCCCC1