Reaction Details
TargetKallikrein-7
LigandBDBM51528
Substrate/Competitorn/a
EC50 3623±n/a nM
Citation PubChem, PC Fluorescence Intensity-based biochemical primary high throughput dose response assay to identify activators of kallikrein-7 (K7) zymogen PubChem Bioassay(2013)[AID]
 
Kallikrein-7
Name:Kallikrein-7
Type:PROTEIN
Mol. Mass.:27535.05
Organism:Homo sapiens (Human)
Description:ChEMBL_1469257
Residue:253
BDBM51528
NameBDBM51528
Synonyms:2-amino-1-(2-piperidinoethyl)pyrrolo[3,2-b]quinoxaline-3-carboxylic acid ethyl ester MLS000056772 cid_1888166 ethyl 2-azanyl-1-(2-piperidin-1-ylethyl)pyrrolo[3,2-b]quinoxaline-3-carboxylate
TypeSmall organic molecule
Emp. Form.C20H25N5O2
Mol. Mass.367.4448
SMILESCCOC(=O)c1c(N)n(CCN2CCCCC2)c2nc3ccccc3nc12