Reaction Details
TargetKallikrein-7
LigandBDBM100019
Substrate/Competitorn/a
EC50 8070±n/a nM
Citation PubChem, PC Fluorescence Intensity-based biochemical primary high throughput dose response assay to identify activators of kallikrein-7 (K7) zymogen PubChem Bioassay(2013)[AID]
 
Kallikrein-7
Name:Kallikrein-7
Type:PROTEIN
Mol. Mass.:27535.05
Organism:Homo sapiens (Human)
Description:ChEMBL_1469257
Residue:253
BDBM100019
NameBDBM100019
Synonyms:4-[[3-cyano-6-methyl-4-(3-pyridinyl)-2-pyridinyl]thio]-3-oxobutanoic acid ethyl ester MLS000050710 cid_2216919 ethyl 4-(3-cyano-6-methyl-4-pyridin-3-ylpyridin-2-yl)sulfanyl-3-oxobutanoate | ethyl 4-[(3'-cyano-6'-methyl-3,4'-bipyridin-2'-yl)thio]-3-oxobutanoate
TypeSmall organic molecule
Emp. Form.C18H17N3O3S
Mol. Mass.355.411
SMILESCCOC(=O)CC(=O)CSc1nc(C)cc(-c2cccnc2)c1C#N