Reaction Details
TargetKallikrein-7
LigandBDBM100031
Substrate/Competitorn/a
EC50 5476±n/a nM
Citation PubChem, PC Fluorescence Intensity-based biochemical primary high throughput dose response assay to identify activators of kallikrein-7 (K7) zymogen PubChem Bioassay(2013)[AID]
 
Kallikrein-7
Name:Kallikrein-7
Type:PROTEIN
Mol. Mass.:27535.05
Organism:Homo sapiens (Human)
Description:ChEMBL_1469257
Residue:253
BDBM100031
NameBDBM100031
Synonyms:MLS000527663 N-(2,3-dimethylquinoxalin-6-yl)piperidine-1-carboxamide SMR000120237 | cid_804520
TypeSmall organic molecule
Emp. Form.C16H20N4O
Mol. Mass.284.3562
SMILESCc1nc2ccc(NC(=O)N3CCCCC3)cc2nc1C