Reaction Details
TargetKallikrein-7
LigandBDBM81149
Substrate/Competitorn/a
EC50>2574±n/a nM
Citation PubChem, PC Fluorescence Intensity-based biochemical primary high throughput dose response assay to identify activators of kallikrein-7 (K7) zymogen PubChem Bioassay(2013)[AID]
 
Kallikrein-7
Name:Kallikrein-7
Type:PROTEIN
Mol. Mass.:27535.05
Organism:Homo sapiens (Human)
Description:ChEMBL_1469257
Residue:253
BDBM81149
NameBDBM81149
Synonyms:MLS001213181 N'-(10H-indolo[3,2-b]quinolin-2-yl)-N,N-dimethylmethanimidamide SMR000542853 | cid_2882843
TypeSmall organic molecule
Emp. Form.C18H16N4
Mol. Mass.288.3464
SMILESCN(C)C=Nc1ccc2nc3c(cc2c1)[nH]c1ccccc31