Reaction Details
TargetKallikrein-7
LigandBDBM100151
Substrate/Competitorn/a
EC50 6325±n/a nM
Citation PubChem, PC Fluorescence Intensity-based biochemical primary high throughput dose response assay to identify activators of kallikrein-7 (K7) zymogen PubChem Bioassay(2013)[AID]
 
Kallikrein-7
Name:Kallikrein-7
Type:PROTEIN
Mol. Mass.:27535.05
Organism:Homo sapiens (Human)
Description:ChEMBL_1469257
Residue:253
BDBM100151
NameBDBM100151
Synonyms:(4-oxidanylidene-5,6,7,8-tetrahydro-3H-[1]benzothiolo[2,3-d]pyrimidin-2-yl)methyl 3-azanylpyrazine-2-carboxylate 3-amino-2-pyrazinecarboxylic acid (4-oxo-5,6,7,8-tetrahydro-3H-[1]benzothiolo[2,3-d]pyrimidin-2-yl)methyl ester MLS001157372 cid_7536382
TypeSmall organic molecule
Emp. Form.C16H15N5O3S
Mol. Mass.357.387
SMILESNc1nccnc1C(=O)OCc1nc2sc3CCCCc3c2c(=O)[nH]1