Reaction Details
TargetKallikrein-7
LigandBDBM100164
Substrate/Competitorn/a
EC50 7952±n/a nM
Citation PubChem, PC Fluorescence Intensity-based biochemical primary high throughput dose response assay to identify activators of kallikrein-7 (K7) zymogen PubChem Bioassay(2013)[AID]
 
Kallikrein-7
Name:Kallikrein-7
Type:PROTEIN
Mol. Mass.:27535.05
Organism:Homo sapiens (Human)
Description:ChEMBL_1469257
Residue:253
BDBM100164
NameBDBM100164
Synonyms:MLS002582724 N-[3-cyano-1-(2-furfuryl)-5-keto-10-methyl-dipyrido[3,4-c:1',2'-f]pyrimidin-2-ylidene]benzamide N-[3-cyano-1-(furan-2-ylmethyl)-10-methyl-5-oxodipyrido[3,4-c:1',2'-f]pyrimidin-2-ylidene]benzamide cid_663304
TypeSmall organic molecule
Emp. Form.C25H17N5O3
Mol. Mass.435.4342
SMILESCc1cccn2c1nc1n(Cc3ccco3)\c(=N\C(=O)c3ccccc3)c(cc1c2=O)C#N