Reaction Details
TargetKallikrein-7
LigandBDBM100182
Substrate/Competitorn/a
EC50>7722±n/a nM
Citation PubChem, PC Fluorescence Intensity-based biochemical primary high throughput dose response assay to identify activators of kallikrein-7 (K7) zymogen PubChem Bioassay(2013)[AID]
 
Kallikrein-7
Name:Kallikrein-7
Type:PROTEIN
Mol. Mass.:27535.05
Organism:Homo sapiens (Human)
Description:ChEMBL_1469257
Residue:253
BDBM100182
NameBDBM100182
Synonyms:1-[2-methyl-1-(2-methylprop-2-enyl)-3-oxidanylidene-indazol-5-yl]-3-(2-thiophen-2-ylethyl)urea 1-[2-methyl-1-(2-methylprop-2-enyl)-3-oxoindazol-5-yl]-3-(2-thiophen-2-ylethyl)urea MLS003119328 cid_49792300
TypeSmall organic molecule
Emp. Form.C19H22N4O2S
Mol. Mass.370.469
SMILESCC(=C)Cn1n(C)c(=O)c2cc(NC(=O)NCCc3cccs3)ccc12