Reaction Details
TargetKallikrein-7
LigandBDBM100186
Substrate/Competitorn/a
EC50 8157±n/a nM
Citation PubChem, PC Fluorescence Intensity-based biochemical primary high throughput dose response assay to identify activators of kallikrein-7 (K7) zymogen PubChem Bioassay(2013)[AID]
 
Kallikrein-7
Name:Kallikrein-7
Type:PROTEIN
Mol. Mass.:27535.05
Organism:Homo sapiens (Human)
Description:ChEMBL_1469257
Residue:253
BDBM100186
NameBDBM100186
Synonyms:(2S,3S,4R,5R)-5-(6-aminopurin-9-yl)-N-[5-(dimethylamino)naphthalen-1-yl]sulfonyl-3,4-bis(oxidanyl)oxolane-2-carboxamide (2S,3S,4R,5R)-5-(6-aminopurin-9-yl)-N-[[5-(dimethylamino)-1-naphthalenyl]sulfonyl]-3,4-dihydroxy-2-oxolanecarboxamide MLS003271259 cid_51360273
TypeSmall organic molecule
Emp. Form.C22H23N7O6S
Mol. Mass.513.526
SMILESCN(C)c1cccc2c(cccc12)S(=O)(=O)NC(=O)[C@H]1O[C@H]([C@H](O)[C@@H]1O)n1cnc2c(N)ncnc12