Reaction Details
TargetCOUP transcription factor 2
LigandBDBM42042
Substrate/Competitorn/a
IC50 2272±n/a nM
Citation PubChem, PC Luminescence-based cell-based high throughput dose response assay to identify inhibitors of COUP-TFII (NR2F2) PubChem Bioassay(2013)[AID]
 
COUP transcription factor 2
Name:COUP transcription factor 2
Type:Enzyme Catalytic Domain
Mol. Mass.:45583.83
Organism:Homo sapiens (Human)
Description:gi_14149746
Residue:414
BDBM42042
NameBDBM42042
Synonyms:4-Ethoxy-N-pyridin-4-ylmethyl-benzenesulfonamide 4-ethoxy-N-(pyridin-4-ylmethyl)benzenesulfonamide SMR000123394 | cid_676047
TypeSmall organic molecule
Emp. Form.C14H16N2O3S
Mol. Mass.292.353
SMILESCCOc1ccc(cc1)S(=O)(=O)NCc1ccncc1