Reaction Details
TargetCOUP transcription factor 2
LigandBDBM62272
Substrate/Competitorn/a
IC50 1253±n/a nM
Citation PubChem, PC Luminescence-based cell-based high throughput dose response assay to identify inhibitors of COUP-TFII (NR2F2) PubChem Bioassay(2013)[AID]
 
COUP transcription factor 2
Name:COUP transcription factor 2
Type:Enzyme Catalytic Domain
Mol. Mass.:45583.83
Organism:Homo sapiens (Human)
Description:gi_14149746
Residue:414
BDBM62272
NameBDBM62272
Synonyms:MLS-0375912.0001 N-[1-(4-tert-butylphenyl)-4,5,6,7-tetrahydroindazol-4-yl]-2-methyl-pyrazole-3-carboxamide cid_24793159
TypeSmall organic molecule
Emp. Form.C22H27N5O
Mol. Mass.377.4827
SMILESCn1nccc1C(=O)NC1CCCc2c1cnn2-c1ccc(cc1)C(C)(C)C