Reaction Details
TargetCOUP transcription factor 2
LigandBDBM100250
Substrate/Competitorn/a
IC50 3820±n/a nM
Citation PubChem, PC Luminescence-based cell-based high throughput dose response assay to identify inhibitors of COUP-TFII (NR2F2) PubChem Bioassay(2013)[AID]
 
COUP transcription factor 2
Name:COUP transcription factor 2
Type:Enzyme Catalytic Domain
Mol. Mass.:45583.83
Organism:Homo sapiens (Human)
Description:gi_14149746
Residue:414
BDBM100250
NameBDBM100250
Synonyms:MLS001159328 N-[4-(3,4-dimethoxyphenyl)-2-thiazolyl]-1-(5,6-dimethyl-4-thieno[2,3-d]pyrimidinyl)-4-piperidinecarboxamide SMR000708794 | cid_24981266
TypeSmall organic molecule
Emp. Form.C25H27N5O3S2
Mol. Mass.509.644
SMILESCOc1ccc(cc1OC)-c1csc(NC(=O)C2CCN(CC2)c2ncnc3sc(C)c(C)c23)n1