Reaction Details
TargetCOUP transcription factor 2
LigandBDBM51840
Substrate/Competitorn/a
IC50 1786±n/a nM
Citation PubChem, PC Luminescence-based cell-based high throughput dose response assay to identify inhibitors of COUP-TFII (NR2F2) PubChem Bioassay(2013)[AID]
 
COUP transcription factor 2
Name:COUP transcription factor 2
Type:Enzyme Catalytic Domain
Mol. Mass.:45583.83
Organism:Homo sapiens (Human)
Description:gi_14149746
Residue:414
BDBM51840
NameBDBM51840
Synonyms:(2Z)-3-ethyl-2-[(1-ethyl-6-methyl-2-quinolin-1-iumyl)methylidene]-5,6-dimethyl-1,3-benzothiazole;iodide (2Z)-3-ethyl-2-[(1-ethyl-6-methyl-quinolin-1-ium-2-yl)methylidene]-5,6-dimethyl-1,3-benzothiazole;iodide MLS000692767 cid_16192804
TypeSmall organic molecule
Emp. Form.C24H27N2S
Mol. Mass.375.549
SMILESCCN1\C(Sc2cc(C)c(C)cc12)=C\c1ccc2cc(C)ccc2[n+]1CC