Reaction Details
TargetCOUP transcription factor 2
LigandBDBM75744
Substrate/Competitorn/a
IC50 2750±n/a nM
Citation PubChem, PC Luminescence-based cell-based high throughput dose response assay to identify inhibitors of COUP-TFII (NR2F2) PubChem Bioassay(2013)[AID]
 
COUP transcription factor 2
Name:COUP transcription factor 2
Type:Enzyme Catalytic Domain
Mol. Mass.:45583.83
Organism:Homo sapiens (Human)
Description:gi_14149746
Residue:414
BDBM75744
NameBDBM75744
Synonyms:(2E)-3-ethyl-2-[(1-ethyl-2-quinolin-1-iumyl)methylidene]-6-methyl-1,3-benzothiazole;iodide (2E)-3-ethyl-2-[(1-ethylquinolin-1-ium-2-yl)methylidene]-6-methyl-1,3-benzothiazole;iodide SMR000284410 | cid_16187754
TypeSmall organic molecule
Emp. Form.C22H23N2S
Mol. Mass.347.496
SMILESCCN1\C(Sc2cc(C)ccc12)=C/c1ccc2ccccc2[n+]1CC