Reaction Details
TargetCOUP transcription factor 2
LigandBDBM93927
Substrate/Competitorn/a
IC50 22.34±n/a nM
Citation PubChem, PC Luminescence-based cell-based high throughput dose response assay to identify inhibitors of COUP-TFII (NR2F2) PubChem Bioassay(2013)[AID]
 
COUP transcription factor 2
Name:COUP transcription factor 2
Type:Enzyme Catalytic Domain
Mol. Mass.:45583.83
Organism:Homo sapiens (Human)
Description:gi_14149746
Residue:414
BDBM93927
NameBDBM93927
Synonyms:MLS002702060 cid_299645
TypeSmall organic molecule
Emp. Form.C26H32O11
Mol. Mass.520.5257
SMILES[#6]-[#8]-[#6](=O)C12[#8]-[#6]C34[#6]1-[#6](-[#8]-[#6](=O)\[#6]=[#6](\[#6])-[#6])-[#6](=O)-[#8]-[#6]3-[#6]-[#6]1-[#6](-[#6])=[#6](-[#8])-[#6](=O)-[#6]C1([#6])[#6]4-[#6](-[#8])-[#6]2-[#8]