Reaction Details
TargetCathepsin K
LigandBDBM100295
Substrate/Competitorn/a
Meas. Tech.In Vitro Inhibition Assay
Ki 0.6±0.0 nM
Citation Quibell, MWatts, JP Piperazine compounds US Patent US8501744 Publication Date 8/6/2013
 
Cathepsin K
Name:Cathepsin K
Type:Enzyme
Mol. Mass.:36975.68
Organism:Homo sapiens (Human)
Description:P43235
Residue:329
BDBM100295
NameBDBM100295
Synonyms:US8501744, 22
TypeSmall organic molecule
Emp. Form.C28H37N5O4S
Mol. Mass.539.689
SMILESCC(C)C[C@H](NC(=O)c1ccc(cc1)-c1csc(n1)N1CCN(C)CC1)C(=O)N1C[C@H](C)[C@H]2OCC(=O)[C@@H]12