Reaction Details
TargetEpoxide hydrolase 1
LigandBDBM50327850
Substrate/Competitorn/a
Meas. Tech.Inhibition Assay
IC50 0.4±0.0 nM
Citation Hammock, BDJones, PDMorisseau, CHuang, HTsai, HGless, Jr., R Conformationally restricted urea inhibitors of soluble epoxide hydrolase US Patent US8501783 Publication Date 8/6/2013
 
Epoxide hydrolase 1
Name:Epoxide hydrolase 1
Type:Protein
Mol. Mass.:52954.28
Organism:Homo sapiens (Human)
Description:P07099
Residue:455
BDBM50327850
NameBDBM50327850
Synonyms:1-(1-Tosylpiperidin-4-yl)-3-(4-(trifluoromethoxy)phenyl)urea US8501783, 1711 | US9296693, 58
TypeSmall organic molecule
Emp. Form.C20H22F3N3O4S
Mol. Mass.457.467
SMILESCc1ccc(cc1)S(=O)(=O)N1CCC(CC1)NC(=O)Nc1ccc(OC(F)(F)F)cc1