Reaction Details
TargetMonoglyceride lipase
LigandBDBM280574
Substrate/Competitorn/a
Meas. Tech.In Vitro Competitive Activity-Based Protein Profiling (Human)
Temperature298.15±n/a K
IC50<100±n/a nM
Commentsextracted
Citation Cisar, JSGrice, CAJones, TKWeber, ODBuzard, DJShaghafi, MB Spirocycle compounds and methods of making and using same US Patent US10030020 Publication Date 7/24/2018
 
Monoglyceride lipase
Name:Monoglyceride lipase
Type:Hydrolase
Mol. Mass.:33264.56
Organism:Homo sapiens (Human)
Description:Human recombinant MGL (Cayman Chemical, cat# 10008354).
Residue:303
BDBM280574
NameBDBM280574
Synonyms:BDBM280666 US10781211, Example 119
TypeSmall organic molecule
Emp. Form.C26H30F9N3O4
Mol. Mass.619.5197
SMILESOC(=O)C1CCN(CC1)c1cc(ccc1CN1CCC2(C1)CCN(CC2)C(=O)OC(C(F)(F)F)C(F)(F)F)C(F)(F)F