Reaction Details
TargetFatty-acid amide hydrolase 1
LigandBDBM280589
Substrate/Competitorn/a
Meas. Tech.In Vitro Competitive Activity-Based Protein Profiling
IC50>1000±n/a nM
Citation Cisar, JSGrice, CAJones, TKWeber, ODBuzard, DJShaghafi, MB Spirocycle compounds and methods of making and using same US Patent US10030020 Publication Date 7/24/2018
 
Fatty-acid amide hydrolase 1
Name:Fatty-acid amide hydrolase 1
Type:Hydrolase; single-pass membrane protein; homodimer
Mol. Mass.:63227.28
Organism:Mus musculus (mouse)
Description:Mouse brain membranes were used in the assay.
Residue:579
BDBM280589
NameBDBM280589
Synonyms:US10030020, Example 134 | US10781211, Example 134
TypeSmall organic molecule
Emp. Form.C24H28F9N3O2
Mol. Mass.561.4836
SMILESFC(F)(F)C(OC(=O)N1CCC2(CCCN2Cc2ccc(c(c2)N2CCCC2)C(F)(F)F)CC1)C(F)(F)F