Reaction Details
TargetMonoacylglycerol lipase ABHD2
LigandBDBM280592
Substrate/Competitorn/a
Meas. Tech.In Vitro Competitive Activity-Based Protein Profiling
IC50<100±n/a nM
Citation Cisar, JSGrice, CAJones, TKWeber, ODBuzard, DJShaghafi, MB Spirocycle compounds and methods of making and using same US Patent US10030020 Publication Date 7/24/2018
 
Monoacylglycerol lipase ABHD2
Name:Monoacylglycerol lipase ABHD2
Type:Enzyme Catalytic Domain
Mol. Mass.:48378.90
Organism:Mus musculus (Mouse)
Description:n/a
Residue:425
BDBM280592
NameBDBM280592
Synonyms:US10030020, Example 137 | US10781211, Example 137
TypeSmall organic molecule
Emp. Form.C21H24F6N2O4
Mol. Mass.482.4167
SMILESFC(F)(F)C(OC(=O)N1CCC2(CCN(Cc3ccc4OCCOc4c3)C2)CC1)C(F)(F)F