Reaction Details
TargetMitogen-activated protein kinase 8
LigandBDBM100502
Substrate/Competitorn/a
Meas. Tech.In Vitro Enzyme Assay
IC50 11±n/a nM
Citation Bilotta, JACheung, AWFirooznia, FGuertin, KRHayden, SHaynes, NLukacs-Lesburg, CMMarcopulos, NMertz, EQi, LQian, YSo, STan, JThakkar, KC Aminomethyl quinolone compounds US Patent US8501732 Publication Date 8/6/2013
 
Mitogen-activated protein kinase 8
Name:Mitogen-activated protein kinase 8
Type:Enzyme
Mol. Mass.:48297.57
Organism:Homo sapiens (Human)
Description:JNK-1 was purchased from Upstate Cell Signaling Solutions (formerly Upstate Biotechnology).
Residue:427
BDBM100502
NameBDBM100502
Synonyms:US8501732, I-62
TypeSmall organic molecule
Emp. Form.C32H32ClN5O4
Mol. Mass.586.081
SMILESCC(C)(C)OC(=O)N1CC2CC1CN2c1ccc(cn1)C(=O)NCc1cn(-c2ccccc2)c2cc(Cl)ccc2c1=O