Reaction Details
TargetMitogen-activated protein kinase 8
LigandBDBM100559
Substrate/Competitorn/a
Meas. Tech.In Vitro Enzyme Assay
IC50 13±n/a nM
Citation Bilotta, JACheung, AWFirooznia, FGuertin, KRHayden, SHaynes, NLukacs-Lesburg, CMMarcopulos, NMertz, EQi, LQian, YSo, STan, JThakkar, KC Aminomethyl quinolone compounds US Patent US8501732 Publication Date 8/6/2013
 
Mitogen-activated protein kinase 8
Name:Mitogen-activated protein kinase 8
Type:Enzyme
Mol. Mass.:48297.57
Organism:Homo sapiens (Human)
Description:JNK-1 was purchased from Upstate Cell Signaling Solutions (formerly Upstate Biotechnology).
Residue:427
BDBM100559
NameBDBM100559
Synonyms:US8501732, I-119
TypeSmall organic molecule
Emp. Form.C29H23ClN4O4
Mol. Mass.526.97
SMILESCOC(=O)c1c(CNC(=O)c2cnn(Cc3ccccc3)c2)c(=O)c2ccc(Cl)cc2n1-c1ccccc1