Reaction Details
TargetMitogen-activated protein kinase 8
LigandBDBM100577
Substrate/Competitorn/a
Meas. Tech.In Vitro Enzyme Assay
IC50 12±n/a nM
Citation Bilotta, JACheung, AWFirooznia, FGuertin, KRHayden, SHaynes, NLukacs-Lesburg, CMMarcopulos, NMertz, EQi, LQian, YSo, STan, JThakkar, KC Aminomethyl quinolone compounds US Patent US8501732 Publication Date 8/6/2013
 
Mitogen-activated protein kinase 8
Name:Mitogen-activated protein kinase 8
Type:Enzyme
Mol. Mass.:48297.57
Organism:Homo sapiens (Human)
Description:JNK-1 was purchased from Upstate Cell Signaling Solutions (formerly Upstate Biotechnology).
Residue:427
BDBM100577
NameBDBM100577
Synonyms:US8501732, I-137
TypeSmall organic molecule
Emp. Form.C25H17ClF2N2O4
Mol. Mass.482.863
SMILESCOC(=O)c1c(CNC(=O)c2ccc(F)c(F)c2)c(=O)c2ccc(Cl)cc2n1-c1ccccc1