Reaction Details
TargetPro-glucagon
LigandBDBM100797
Substrate/Competitorn/a
Meas. Tech.Glucagon SPA Assay
pH7.4±0
Ki 69.8±0.0 nM
Citation Aspnes, GEDidiuk, MTFilipski, KJGuzman-Perez, ALee, ECPfefferkorn, JAStevens, BDTu, MM Glucagon receptor modulators US Patent US8507533 Publication Date 8/13/2013
 
Pro-glucagon
Name:Pro-glucagon
Type:Enzyme
Mol. Mass.:20907.95
Organism:Homo sapiens (Human)
Description:P01275
Residue:180
BDBM100797
NameBDBM100797
Synonyms:US8507533, 105
TypeSmall organic molecule
Emp. Form.C25H28F3N5O3
Mol. Mass.503.5167
SMILESCC(C)CC(Nc1cnc(c(C)c1)-n1cc(cn1)C(F)(F)F)c1ccc(cc1)C(=O)NCCC(O)=O