Reaction Details
TargetPro-glucagon
LigandBDBM100838
Substrate/Competitorn/a
Meas. Tech.Glucagon SPA Assay
pH7.4±0
Ki 32.3±0.0 nM
Citation Aspnes, GEDidiuk, MTFilipski, KJGuzman-Perez, ALee, ECPfefferkorn, JAStevens, BDTu, MM Glucagon receptor modulators US Patent US8507533 Publication Date 8/13/2013
 
Pro-glucagon
Name:Pro-glucagon
Type:Enzyme
Mol. Mass.:20907.95
Organism:Homo sapiens (Human)
Description:P01275
Residue:180
BDBM100838
NameBDBM100838
Synonyms:US8507533, 153
TypeSmall organic molecule
Emp. Form.C26H28F3N3O5
Mol. Mass.519.5128
SMILESCCCC(Oc1cc(C)c(c(OC)c1)-n1cc(cn1)C(F)(F)F)c1ccc(cc1)C(=O)NCCC(O)=O