Reaction Details
TargetPro-glucagon
LigandBDBM100844
Substrate/Competitorn/a
Meas. Tech.Glucagon SPA Assay
pH7.4±0
Ki 29±0.0 nM
Citation Aspnes, GEDidiuk, MTFilipski, KJGuzman-Perez, ALee, ECPfefferkorn, JAStevens, BDTu, MM Glucagon receptor modulators US Patent US8507533 Publication Date 8/13/2013
 
Pro-glucagon
Name:Pro-glucagon
Type:Enzyme
Mol. Mass.:20907.95
Organism:Homo sapiens (Human)
Description:P01275
Residue:180
BDBM100844
NameBDBM100844
Synonyms:US8507533, 160 | US8507533, 398
TypeSmall organic molecule
Emp. Form.C28H29N5O3
Mol. Mass.483.5616
SMILESCCCC(Nc1ccc(nc1)-n1cc(cn1)-c1ccccc1)c1ccc(cc1)C(=O)NCCC(O)=O