Reaction Details
TargetPro-glucagon
LigandBDBM2229
Substrate/Competitorn/a
Meas. Tech.Glucagon SPA Assay
pH7.4±0
Ki 47.8±0.0 nM
Citation Aspnes, GEDidiuk, MTFilipski, KJGuzman-Perez, ALee, ECPfefferkorn, JAStevens, BDTu, MM Glucagon receptor modulators US Patent US8507533 Publication Date 8/13/2013
 
Pro-glucagon
Name:Pro-glucagon
Type:Enzyme
Mol. Mass.:20907.95
Organism:Homo sapiens (Human)
Description:P01275
Residue:180
BDBM2229
NameBDBM2229
Synonyms:US8507533, 187 | US8507533, 448
Typen/a
Emp. Form.C29H31N3O4
Mol. Mass.485.5741
SMILESCCC[C@H](Oc1cc(C)c(c(C)c1)-n1cc2ccccc2n1)c1ccc(cc1)C(=O)NCCC(O)=O