Reaction Details
TargetCalcitonin gene-related peptide type 1 receptor
LigandBDBM100869
Substrate/Competitorn/a
Meas. Tech.Binding Assay
Ki 1.3±0.0 nM
Citation Wood, MRBell, IMKim, JJSelnick, HGStump, CA 3- and 6-quinolines with N-attached heterocyclic CGRP receptor antagonists US Patent US8507477 Publication Date 8/13/2013
 
Calcitonin gene-related peptide type 1 receptor
Name:Calcitonin gene-related peptide type 1 receptor
Type:Enzyme Catalytic Domain
Mol. Mass.:52980.45
Organism:Homo sapiens (Human)
Description:Q16602
Residue:461
BDBM100869
NameBDBM100869
Synonyms:US8507477, 10
TypeSmall organic molecule
Emp. Form.C32H26ClN5O2
Mol. Mass.548.034
SMILESClc1ccccc1C1=NC2(CCCC2)C(=O)N1Cc1cnc2cc3C[C@]4(Cc3cc2c1)C(=O)Nc1ncccc41