Reaction Details
TargetCalcitonin gene-related peptide type 1 receptor
LigandBDBM100872
Substrate/Competitorn/a
Meas. Tech.Binding Assay
Ki 0.062±0.0 nM
Citation Wood, MRBell, IMKim, JJSelnick, HGStump, CA 3- and 6-quinolines with N-attached heterocyclic CGRP receptor antagonists US Patent US8507477 Publication Date 8/13/2013
 
Calcitonin gene-related peptide type 1 receptor
Name:Calcitonin gene-related peptide type 1 receptor
Type:Enzyme Catalytic Domain
Mol. Mass.:52980.45
Organism:Homo sapiens (Human)
Description:Q16602
Residue:461
BDBM100872
NameBDBM100872
Synonyms:US8507477, 13
TypeSmall organic molecule
Emp. Form.C35H33F2N5O2
Mol. Mass.593.6656
SMILESCN1C[C@](C)(N(Cc2cnc3cc4C[C@]5(Cc4cc3c2)C(=O)Nc2ncccc52)C(=O)C11CCCC1)c1cc(F)cc(F)c1