Reaction Details
TargetCalcitonin gene-related peptide type 1 receptor
LigandBDBM100875
Substrate/Competitorn/a
Meas. Tech.Binding Assay
Ki 57±0.0 nM
Citation Wood, MRBell, IMKim, JJSelnick, HGStump, CA 3- and 6-quinolines with N-attached heterocyclic CGRP receptor antagonists US Patent US8507477 Publication Date 8/13/2013
 
Calcitonin gene-related peptide type 1 receptor
Name:Calcitonin gene-related peptide type 1 receptor
Type:Enzyme Catalytic Domain
Mol. Mass.:52980.45
Organism:Homo sapiens (Human)
Description:Q16602
Residue:461
BDBM100875
NameBDBM100875
Synonyms:US8507477, 17
TypeSmall organic molecule
Emp. Form.C29H24FN5O2
Mol. Mass.493.5316
SMILESFc1ccc(cc1)C1N(Cc2cnc3cc4C[C@]5(Cc4cc3c2)C(=O)Nc2ncccc52)CCNC1=O