Reaction Details
TargetSphingosine 1-phosphate receptor 3
LigandBDBM101038
Substrate/Competitorn/a
Meas. Tech.Inhibition Assay
IC50 5±0.0 nM
Citation Beard, RLYuan, HDonello, JELiu, XDuong, T 6-substituted indole-3-carboxylic acid amide compounds having sphingosine-1-phosphate (S1P) receptor antagonist biological activity US Patent US8524917 Publication Date 9/3/2013
 
Sphingosine 1-phosphate receptor 3
Name:Sphingosine 1-phosphate receptor 3
Type:G Protein-Coupled Receptor (GPCR)
Mol. Mass.:42278.13
Organism:Homo sapiens (Human)
Description:Q99500
Residue:378
BDBM101038
NameBDBM101038
Synonyms:US8524917, 11 | US8563594, 169
TypeSmall organic molecule
Emp. Form.C29H30F2N2O2
Mol. Mass.476.5575
SMILESCCCOc1ccc2c(C(=O)NCc3ccc(F)c(F)c3)c(C(C)C)n(Cc3ccccc3)c2c1