Reaction Details
TargetEpidermal growth factor receptor
LigandBDBM101231
Substrate/Competitorn/a
Meas. Tech.Inhibition Assay
pH7±0
Temperature295.15±0 K
IC50 1.0±0.0 nM
Citation Schirok, HLi-Sommer, YBrands, MLobell, MTersteegen, AHimmel, HSchlemmer, KLang, DPetersen, KRenz, MMumberg, DHoffmann, JSiemeister, GBömer, U Substituted tricyclic compounds and methods of use thereof US Patent US8524722 Publication Date 9/3/2013
 
Epidermal growth factor receptor
Name:Epidermal growth factor receptor
Type:Receptor Kinase Domain
Mol. Mass.:134279.59
Organism:Homo sapiens (Human)
Description:P00533
Residue:1210
BDBM101231
NameBDBM101231
Synonyms:US8524722, 31
TypeSmall organic molecule
Emp. Form.C25H29ClFN5O3S
Mol. Mass.534.046
SMILESCOCCN(CCOC)C\C=C\C(=O)N1CCc2c(C1)sc1ncnc(Nc3ccc(F)c(Cl)c3)c21