Reaction Details
TargetEpidermal growth factor receptor
LigandBDBM101243
Substrate/Competitorn/a
Meas. Tech.Inhibition Assay
pH7±0
Temperature295.15±0 K
IC50 1.0±0.0 nM
Citation Schirok, HLi-Sommer, YBrands, MLobell, MTersteegen, AHimmel, HSchlemmer, KLang, DPetersen, KRenz, MMumberg, DHoffmann, JSiemeister, GBömer, U Substituted tricyclic compounds and methods of use thereof US Patent US8524722 Publication Date 9/3/2013
 
Epidermal growth factor receptor
Name:Epidermal growth factor receptor
Type:Receptor Kinase Domain
Mol. Mass.:134279.59
Organism:Homo sapiens (Human)
Description:P00533
Residue:1210
BDBM101243
NameBDBM101243
Synonyms:US8524722, 143
TypeSmall organic molecule
Emp. Form.C25H27Cl2N5O2S
Mol. Mass.532.485
SMILESClc1ccc(Nc2ncnc3sc4CN(CCCc4c23)C(=O)\C=C\CN2CCCOCC2)cc1Cl