Reaction Details
TargetAmine oxidase [flavin-containing] A
LigandBDBM101261
Substrate/Competitorn/a
Meas. Tech.Biological Assay
Ki 2.55e+4±n/a nM
Citation Guibourt, NMunoz, AOLaria, JC Oxidase inhibitors and their use US Patent US8524717 Publication Date 9/3/2013
 
Amine oxidase [flavin-containing] A
Name:Amine oxidase [flavin-containing] A
Type:Protein
Mol. Mass.:59689.53
Organism:Homo sapiens (Human)
Description:P21397
Residue:527
BDBM101261
NameBDBM101261
Synonyms:US8524717, 16
TypeSmall organic molecule
Emp. Form.C15H21N3O
Mol. Mass.259.3467
SMILESN[C@H]1CCN(C1)C(=O)CN[C@H]1C[C@@H]1c1ccccc1