Reaction Details
TargetAmine oxidase [flavin-containing] A
LigandBDBM101270
Substrate/Competitorn/a
Meas. Tech.Biological Assay
Ki 2.32e+3±n/a nM
Citation Guibourt, NMunoz, AOLaria, JC Oxidase inhibitors and their use US Patent US8524717 Publication Date 9/3/2013
 
Amine oxidase [flavin-containing] A
Name:Amine oxidase [flavin-containing] A
Type:Protein
Mol. Mass.:59689.53
Organism:Homo sapiens (Human)
Description:P21397
Residue:527
BDBM101270
NameBDBM101270
Synonyms:US8524717, 25
TypeSmall organic molecule
Emp. Form.C21H25N3O
Mol. Mass.335.4427
SMILESO=C(CN[C@H]1C[C@@H]1c1ccccc1)N1CCN(CC1)c1ccccc1