Reaction Details
TargetAmine oxidase [flavin-containing] A
LigandBDBM101278
Substrate/Competitorn/a
Meas. Tech.Biological Assay
Ki 1.42e+4±n/a nM
Citation Guibourt, NMunoz, AOLaria, JC Oxidase inhibitors and their use US Patent US8524717 Publication Date 9/3/2013
 
Amine oxidase [flavin-containing] A
Name:Amine oxidase [flavin-containing] A
Type:Protein
Mol. Mass.:59689.53
Organism:Homo sapiens (Human)
Description:P21397
Residue:527
BDBM101278
NameBDBM101278
Synonyms:US8524717, 33
TypeSmall organic molecule
Emp. Form.C24H28N4O2
Mol. Mass.404.5047
SMILESCN1CCN(CC1)C(=O)CN[C@H]1C[C@@H]1c1ccc(OCc2ccc(cc2)[N+]#[C-])cc1