Reaction Details
TargetAmine oxidase [flavin-containing] A
LigandBDBM101291
Substrate/Competitorn/a
Meas. Tech.Biological Assay
Ki 3.84e+4±n/a nM
Citation Guibourt, NMunoz, AOLaria, JC Oxidase inhibitors and their use US Patent US8524717 Publication Date 9/3/2013
 
Amine oxidase [flavin-containing] A
Name:Amine oxidase [flavin-containing] A
Type:Protein
Mol. Mass.:59689.53
Organism:Homo sapiens (Human)
Description:P21397
Residue:527
BDBM101291
NameBDBM101291
Synonyms:US8524717, 46
TypeSmall organic molecule
Emp. Form.C22H25F2N3O
Mol. Mass.385.4502
SMILESCN1CCN(CC1)C(=O)CN[C@H]1C[C@@H]1c1ccc(cc1)-c1ccc(F)cc1F