Reaction Details
TargetAmine oxidase [flavin-containing] A
LigandBDBM101293
Substrate/Competitorn/a
Meas. Tech.Biological Assay
Ki 3.19e+4±n/a nM
Citation Guibourt, NMunoz, AOLaria, JC Oxidase inhibitors and their use US Patent US8524717 Publication Date 9/3/2013
 
Amine oxidase [flavin-containing] A
Name:Amine oxidase [flavin-containing] A
Type:Protein
Mol. Mass.:59689.53
Organism:Homo sapiens (Human)
Description:P21397
Residue:527
BDBM101293
NameBDBM101293
Synonyms:US8524717, 48
TypeSmall organic molecule
Emp. Form.C22H26FN3O
Mol. Mass.367.4597
SMILESCN1CCN(CC1)C(=O)CN[C@H]1C[C@@H]1c1ccc(cc1)-c1ccccc1F