Reaction Details
TargetAmine oxidase [flavin-containing] B
LigandBDBM101261
Substrate/Competitorn/a
Meas. Tech.Biological Assay
Ki>4.0e+4±n/a nM
Citation Guibourt, NMunoz, AOLaria, JC Oxidase inhibitors and their use US Patent US8524717 Publication Date 9/3/2013
 
Amine oxidase [flavin-containing] B
Name:Amine oxidase [flavin-containing] B
Type:Protein
Mol. Mass.:58768.76
Organism:Homo sapiens (Human)
Description:P27338
Residue:520
BDBM101261
NameBDBM101261
Synonyms:US8524717, 16
TypeSmall organic molecule
Emp. Form.C15H21N3O
Mol. Mass.259.3467
SMILESN[C@H]1CCN(C1)C(=O)CN[C@H]1C[C@@H]1c1ccccc1