Reaction Details
TargetAmine oxidase [flavin-containing] B
LigandBDBM101270
Substrate/Competitorn/a
Meas. Tech.Biological Assay
Ki 1.9e+3±n/a nM
Citation Guibourt, NMunoz, AOLaria, JC Oxidase inhibitors and their use US Patent US8524717 Publication Date 9/3/2013
 
Amine oxidase [flavin-containing] B
Name:Amine oxidase [flavin-containing] B
Type:Protein
Mol. Mass.:58768.76
Organism:Homo sapiens (Human)
Description:P27338
Residue:520
BDBM101270
NameBDBM101270
Synonyms:US8524717, 25
TypeSmall organic molecule
Emp. Form.C21H25N3O
Mol. Mass.335.4427
SMILESO=C(CN[C@H]1C[C@@H]1c1ccccc1)N1CCN(CC1)c1ccccc1