Reaction Details
TargetAmine oxidase [flavin-containing] B
LigandBDBM101289
Substrate/Competitorn/a
Meas. Tech.Biological Assay
Ki 1.21e+4±n/a nM
Citation Guibourt, NMunoz, AOLaria, JC Oxidase inhibitors and their use US Patent US8524717 Publication Date 9/3/2013
 
Amine oxidase [flavin-containing] B
Name:Amine oxidase [flavin-containing] B
Type:Protein
Mol. Mass.:58768.76
Organism:Homo sapiens (Human)
Description:P27338
Residue:520
BDBM101289
NameBDBM101289
Synonyms:US8524717, 44
TypeSmall organic molecule
Emp. Form.C23H29N3O3S
Mol. Mass.427.56
SMILESCN1CCN(CC1)C(=O)CN[C@H]1C[C@@H]1c1ccc(cc1)-c1ccc(cc1)S(C)(=O)=O