Reaction Details
TargetAmine oxidase [flavin-containing] B
LigandBDBM101298
Substrate/Competitorn/a
Meas. Tech.Biological Assay
Ki>4.0e+4±n/a nM
Citation Guibourt, NMunoz, AOLaria, JC Oxidase inhibitors and their use US Patent US8524717 Publication Date 9/3/2013
 
Amine oxidase [flavin-containing] B
Name:Amine oxidase [flavin-containing] B
Type:Protein
Mol. Mass.:58768.76
Organism:Homo sapiens (Human)
Description:P27338
Residue:520
BDBM101298
NameBDBM101298
Synonyms:US8524717, 53
TypeSmall organic molecule
Emp. Form.C23H28FN3O2
Mol. Mass.397.4857
SMILESCOc1cc(F)ccc1-c1ccc(cc1)[C@H]1C[C@@H]1NCC(=O)N1CCN(C)CC1